BDBM50205080 2-((3-(2-(5-methyl-2-phenyloxazol-4-yl)ethoxy)benzyl)(3-phenylpropyl)amino)acetic acid::CHEMBL428748
SMILES Cc1oc(nc1CCOc1cccc(CN(CCCc2ccccc2)CC(O)=O)c1)-c1ccccc1
InChI Key InChIKey=OKAJTZNCNFNXOS-UHFFFAOYSA-N
Data  2 IC50  2 EC50
  Tab Delimited (TSV)   2D SDfile   Computed 3D by Vconf -m prep SDfile
Find this compound or compounds like it in BindingDB:
Activity Spreadsheet -- Enzyme Inhibition Constant Data from BindingDB
Found 2 hits for monomerid = 50205080
TargetPeroxisome proliferator-activated receptor alpha(Homo sapiens (Human))
Bristol-Myers Squibb Pharmaceutical Research Institute
Curated by ChEMBL
LigandPNGBDBM50205080(2-((3-(2-(5-methyl-2-phenyloxazol-4-yl)ethoxy)benz...)
Affinity DataIC50:  51nM. Assay description: Displacement of fluorescein labeled ligand from PPARalpha receptor by fluorescence polarization assay
In DepthDetails ArticlePubMed
TargetPeroxisome proliferator-activated receptor alpha(Homo sapiens (Human))
Bristol-Myers Squibb Pharmaceutical Research Institute
Curated by ChEMBL
LigandPNGBDBM50205080(2-((3-(2-(5-methyl-2-phenyloxazol-4-yl)ethoxy)benz...)
Affinity DataEC50:  47nM. Assay description: Agonist activity at PPARalpha receptor expressed in HEK293 cells by GAL4 transactivation assay
In DepthDetails ArticlePubMed